{"text_format":"1","workbook":"xlsx","n_sheets":5,"sheets":["Introduction","Indicator Definitions","Output","Change Log","Sheet1"],"not_rendered":{"charts":0,"images":36,"macros":1,"external_links":1,"defined_names":23,"comments":0,"pivot_tables":0},"unopened":[],"bounds":{"document_bytes":16777216,"sheet_cells":100000,"rows_first":2000,"rows_last":500,"rows_between":2000,"halvings":0,"cell_chars":16384,"cell_head_chars":4096},"cells_cut":0,"cells_raw":0,"read":"whole","date_system":"1900"}

{"sheet":"Introduction","index":0,"n_rows":30,"n_cols":7,"rows_kept":30,"cut":false,"hidden":false,"merged":[[15,5,17,17]]}
[]
[]
[null,null,null,null,"Health & Social Care Maps: Indicator Definitions"]
[]
[]
[]
[]
[]
[]
[null,null,null,null,null,"Introduction"]
[]
[null,null,null,null,null,"The following pages are included this tool"]
[null,null,null,null,null,null,"Introduction - provides an overview instructions and guidance"]
[null,null,null,null,null,null,"Indicator definitions - contains information on the indicators included within the Health & Social Care Maps"]
[]
{"$rows_left_out":16}
{"sheet":"Indicator Definitions","index":1,"n_rows":108,"n_cols":11,"rows_kept":108,"cut":false,"hidden":false,"merged":[]}
["ID","Domain","Subset","Indicator ","Subheader","Smallprint","Definition","Notes","National Release ","Source","Select for report"]
[{"$f":"'[1]Indicator Definitions'!A2","v":"S05"},{"$f":"'[1]Indicator Definitions'!B2","v":"Starting Well"},{"$f":"'[1]Indicator Definitions'!C2","v":"Birth statistics"},{"$f":"'[1]Indicator Definitions'!D2","v":"General fertility rate"},{"$f":"'[1]Indicator Definitions'!E2","v":"The crude rate of total live births per 1,000 women aged 15 to 44"},{"$f":"IF('[1]Indicator Definitions'!F2=0, \"\", '[1]Indicator Definitions'!F2)","v":""},{"$f":"'[1]Indicator Definitions'!G2","v":"The crude rate of total live births per 1,000 women aged 15 to 44. Numerator: total live births for the years used by area of residence. Denominator: mid-year population estimates for females aged 15 to 44 for the years used by area of residence.\n"},{"$f":"IF('[1]Indicator Definitions'!H2=0, \"\", '[1]Indicator Definitions'!H2)","v":"A measure of current fertility levels. This uses the information collected at birth registration, representing births occurring within the calendar year and a small number of late registrations from the previous year. Birth registration is legally required within 42 days of occurrence and most information collected is typically supplied to registrars by one or both parents.  "},{"$f":"IF('[1]Indicator Definitions'!I2=0, \"\", '[1]Indicator Definitions'!I2)","v":"Annual August"},{"$f":"'[1]Indicator Definitions'!L2","v":"ONS, NHS Digital"},"N"]
[{"$f":"'[1]Indicator Definitions'!A3","v":"S19"},{"$f":"'[1]Indicator Definitions'!B3","v":"Starting Well"},{"$f":"'[1]Indicator Definitions'!C3","v":"Birth statistics"},{"$f":"'[1]Indicator Definitions'!D3","v":"Infant mortality rate"},{"$f":"'[1]Indicator Definitions'!E3","v":"Crude rate of deaths that occur in infants under the age of 1 year per 1,000 live births"},{"$f":"IF('[1]Indicator Definitions'!F3=0, \"\", '[1]Indicator Definitions'!F3)","v":""},{"$f":"'[1]Indicator Definitions'!G3","v":"Crude rate of deaths that occur in infants under the age of 1 year per 1,000 live births. Numerator: Office for National Statistics death registrations in infants under the age of 1 year for the years used by area of residence. Denominator: Office for National Statistics live birth registrations for the years used by area of residence\n"},{"$f":"IF('[1]Indicator Definitions'!H3=0, \"\", '[1]Indicator Definitions'!H3)","v":"This uses the Primary Care Mortality database and the information recorded when deaths are certified and registered. Death certification is completed by the attending doctor who must have seen the deceased during the last 2 weeks of life.  Death registration should occur within 5 days of the date of death. Registration may be delayed when a death certificate cannot be issued immediately, from referral to the coroner.  Our statistics are based on registration, representing deaths registered within the respective calendar year. "},{"$f":"IF('[1]Indicator Definitions'!I3=0, \"\", '[1]Indicator Definitions'!I3)","v":"Annual August"},{"$f":"'[1]Indicator Definitions'!L3","v":"PCMD, ONS, NHS Digital"},"N"]
[{"$f":"'[1]Indicator Definitions'!A4","v":"S06"},{"$f":"'[1]Indicator Definitions'!B4","v":"Starting Well"},{"$f":"'[1]Indicator Definitions'!C4","v":"Birth statistics"},{"$f":"'[1]Indicator Definitions'!D4","v":"Low birth weight"},{"$f":"'[1]Indicator Definitions'!E4","v":"The percentage of live births with low birth weight"},{"$f":"IF('[1]Indicator Definitions'!F4=0, \"\", '[1]Indicator Definitions'!F4)","v":"2500 grams or less"},{"$f":"'[1]Indicator Definitions'!G4","v":"The percentage of live births with low birth weight or very low birth weight. Numerator: total live births categorised as low birth weight (2500 grams or less) OR total live births categorised as very low birth weight (1500 grams or less) for the years used by area of residence. Denominator: total live births (excluding stillborn) for the years used by area of residence.\n"},{"$f":"IF('[1]Indicator Definitions'!H4=0, \"\", '[1]Indicator Definitions'!H4)","v":"This uses the information collected at birth registration, representing births occurring within the calendar year and some late registrations from the previous year. Birth registration is legally required within 42 days and most information is typically supplied to registrars by parents. Birthweight is received by NHS notification to the registrar by the hospital where birth took place or by midwife or doctor attending the birth."},{"$f":"IF('[1]Indicator Definitions'!I4=0, \"\", '[1]Indicator Definitions'!I4)","v":"Annual August"},{"$f":"'[1]Indicator Definitions'!L4","v":"ONS, NHS Digital"},"N"]
[{"$f":"'[1]Indicator Definitions'!A5","v":"S26"},{"$f":"'[1]Indicator Definitions'!B5","v":"Starting Well"},{"$f":"'[1]Indicator Definitions'!C5","v":"Birth statistics"},{"$f":"'[1]Indicator Definitions'!D5","v":"Teenage conceptions"},{"$f":"'[1]Indicator Definitions'!E5","v":"Rate per 1,000 15-17 year olds"},{"$f":"IF('[1]Indicator Definitions'!F5=0, \"\", '[1]Indicator Definitions'!F5)","v":""},{"$f":"'[1]Indicator Definitions'!G5","v":"Conceptions in women aged under 18 per 1,000 females aged 15-17.  Numerator: Number of pregnancies that occur in women aged under 18 and result in either one or more live or still births or a legal abortion under the Abortion Act 1967. Denominator: Mid-year population estimates for the relevant age group and for the years used by area of residence."},{"$f":"IF('[1]Indicator Definitions'!H5=0, \"\", '[1]Indicator Definitions'!H5)","v":""},{"$f":"IF('[1]Indicator Definitions'!I5=0, \"\", '[1]Indicator Definitions'!I5)","v":"Annual September"},{"$f":"'[1]Indicator Definitions'!L5","v":"ONS"},"N"]
[{"$f":"'[1]Indicator Definitions'!A6","v":"S03"},{"$f":"'[1]Indicator Definitions'!B6","v":"Starting Well"},{"$f":"'[1]Indicator Definitions'!C6","v":"Demographics"},{"$f":"'[1]Indicator Definitions'!D6","v":"Children & young people aged 0-19 years"},{"$f":"'[1]Indicator Definitions'!E6","v":"Office for National Statistics mid-year estimates"},{"$f":"IF('[1]Indicator Definitions'!F6=0, \"\", '[1]Indicator Definitions'!F6)","v":"number and percentage of the relevant resident population"},{"$f":"'[1]Indicator Definitions'!G6","v":"Office for National Statistics mid-year estimates of the relevant resident population. Numerator: number of children in age group within each electoral ward. Denominator: number of children in age group within each Local Authority or Clinical Commissioning Group."},{"$f":"IF('[1]Indicator Definitions'!H6=0, \"\", '[1]Indicator Definitions'!H6)","v":"This uses the Office for National Statistics estimates that are produced annually by age and sex. This is available at a national, local authority and small area (lower layer super output area). \nThe national and local authority population estimates are derived using the cohort component method from the most recent census with adjustment for births, deaths and migration.\nThe small area estimates are derived using the ratio change and best fit method from the most recent census; past releases have used patient register and child benefit data. \n"},{"$f":"IF('[1]Indicator Definitions'!I6=0, \"\", '[1]Indicator Definitions'!I6)","v":"Annual October"},{"$f":"'[1]Indicator Definitions'!L6","v":" "},"N"]
[{"$f":"'[1]Indicator Definitions'!A7","v":"S02"},{"$f":"'[1]Indicator Definitions'!B7","v":"Starting Well"},{"$f":"'[1]Indicator Definitions'!C7","v":"Demographics"},{"$f":"'[1]Indicator Definitions'!D7","v":"Children aged 0-4 years"},{"$f":"'[1]Indicator Definitions'!E7","v":"Office for National Statistics mid-year estimates"},{"$f":"IF('[1]Indicator Definitions'!F7=0, \"\", '[1]Indicator Definitions'!F7)","v":"number and percentage of the relevant resident population"},{"$f":"'[1]Indicator Definitions'!G7","v":"Office for National Statistics mid-year estimates of the relevant resident population. Numerator: number of children in age group within each electoral ward. Denominator: number of children in age group within each Local Authority or Clinical Commissioning Group."},{"$f":"IF('[1]Indicator Definitions'!H7=0, \"\", '[1]Indicator Definitions'!H7)","v":"This uses the Office for National Statistics estimates that are produced annually by age and sex. This is available at a national, local authority and small area (lower layer super output area). \nThe national and local authority population estimates are derived using the cohort component method from the most recent census with adjustment for births, deaths and migration.\nThe small area estimates are derived using the ratio change and best fit method from the most recent census; past releases have used patient register and child benefit data. \n"},{"$f":"IF('[1]Indicator Definitions'!I7=0, \"\", '[1]Indicator Definitions'!I7)","v":"Annual October"},{"$f":"'[1]Indicator Definitions'!L7","v":"ONS"},"N"]
[{"$f":"'[1]Indicator Definitions'!A8","v":"S01"},{"$f":"'[1]Indicator Definitions'!B8","v":"Starting Well"},{"$f":"'[1]Indicator Definitions'!C8","v":"Demographics"},{"$f":"'[1]Indicator Definitions'!D8","v":"Income deprivation affecting children (IDACI)"},{"$f":"'[1]Indicator Definitions'!E8","v":"The percentage of children aged 0-15 years living in income deprived households"},{"$f":"IF('[1]Indicator Definitions'!F8=0, \"\", '[1]Indicator Definitions'!F8)","v":""},{"$f":"'[1]Indicator Definitions'!G8","v":"The percentage of children aged 0-15 years living in income deprived households. Families that either receive Income Support or income-based Jobseekers Allowance or Employment and Support Allowance or Pension Credit (Guarantee) or Working Tax Credit or Child Tax Credit with an equivalised income below 60 per cent of the national median."},{"$f":"IF('[1]Indicator Definitions'!H8=0, \"\", '[1]Indicator Definitions'!H8)","v":"The Indices of Deprivation 2015 have been constructed for the Department for Communities and Local Government (DCLG) by Oxford Consultants for Social Inclusion (OCSI)."},{"$f":"IF('[1]Indicator Definitions'!I8=0, \"\", '[1]Indicator Definitions'!I8)","v":"2015-09-01"},{"$f":"'[1]Indicator Definitions'!L8","v":"DCLG"},"N"]
[{"$f":"'[1]Indicator Definitions'!A9","v":"S25"},{"$f":"'[1]Indicator Definitions'!B9","v":"Starting Well"},{"$f":"'[1]Indicator Definitions'!C9","v":"Demographics"},{"$f":"'[1]Indicator Definitions'!D9","v":"Population projections: Children & young people aged 0-19 years"},{"$f":"'[1]Indicator Definitions'!E9","v":"Office for National Statistics 2016-based projections"},{"$f":"IF('[1]Indicator Definitions'!F9=0, \"\", '[1]Indicator Definitions'!F9)","v":"KCC housing-led forecast (October 2018)"},{"$f":"'[1]Indicator Definitions'!G9","v":"Forecasted mid-year estimates of the relevant resident population. Two different forecasts are shown:  the Office for National Statistics forecasts & KCC's own housing-led forecasts.  The KCC forecasts take account of housing plans, which are not included within the ONS projections."},{"$f":"IF('[1]Indicator Definitions'!H9=0, \"\", '[1]Indicator Definitions'!H9)","v":""},{"$f":"IF('[1]Indicator Definitions'!I9=0, \"\", '[1]Indicator Definitions'!I9)","v":"Annual August/October"},{"$f":"'[1]Indicator Definitions'!L9","v":"ONS, KCC"},"N"]
[{"$f":"'[1]Indicator Definitions'!A10","v":"S24"},{"$f":"'[1]Indicator Definitions'!B10","v":"Starting Well"},{"$f":"'[1]Indicator Definitions'!C10","v":"Demographics"},{"$f":"'[1]Indicator Definitions'!D10","v":"Population projections: Children aged 0-4 years"},{"$f":"'[1]Indicator Definitions'!E10","v":"Office for National Statistics 2016-based projections"},{"$f":"IF('[1]Indicator Definitions'!F10=0, \"\", '[1]Indicator Definitions'!F10)","v":"KCC housing-led forecast (October 2018)"},{"$f":"'[1]Indicator Definitions'!G10","v":"Forecasted mid-year estimates of the relevant resident population. Two different forecasts are shown:  the Office for National Statistics forecasts & KCC's own housing-led forecasts.  The KCC forecasts take account of housing plans, which are not included within the ONS projections."},{"$f":"IF('[1]Indicator Definitions'!H10=0, \"\", '[1]Indicator Definitions'!H10)","v":""},{"$f":"IF('[1]Indicator Definitions'!I10=0, \"\", '[1]Indicator Definitions'!I10)","v":"Annual August/October"},{"$f":"'[1]Indicator Definitions'!L10","v":"ONS, KCC"},"N"]
[{"$f":"'[1]Indicator Definitions'!A11","v":"S10"},{"$f":"'[1]Indicator Definitions'!B11","v":"Starting Well"},{"$f":"'[1]Indicator Definitions'!C11","v":"Healthcare usage"},{"$f":"'[1]Indicator Definitions'!D11","v":"Accident & Emergency attendances in children & young people aged 0-19 years"},{"$f":"'[1]Indicator Definitions'!E11","v":"Crude rate per 1,000 children and young people aged 0-19 years"},{"$f":"IF('[1]Indicator Definitions'!F11=0, \"\", '[1]Indicator Definitions'!F11)","v":""},{"$f":"'[1]Indicator Definitions'!G11","v":"Crude rate of accident and emergency attendances per 1,000 relevant resident population. Numerator: total number of accident and emergency attendances using age at activity date for the years used by area of residence. This includes all department types, including; consultant led 24-hour services, speciality services (e.g. ophthalmology & dental) and minor injury unit. Excludes NHS walk in centres. Attendance category 1. Denominator: mid-year population estimates for the relevant age group and for the years used by area of residence.\n"},{"$f":"IF('[1]Indicator Definitions'!H11=0, \"\", '[1]Indicator Definitions'!H11)","v":"Public Health England caveat their use of the Hospital Episode Statistics dataset “which has a number of continuing issues regarding quality and coverage of certain key fields. Completeness of data by provider varies, overall completeness when compared to the weekly A&E sit reps is around 86%”"},{"$f":"IF('[1]Indicator Definitions'!I11=0, \"\", '[1]Indicator Definitions'!I11)","v":"Annual October"},{"$f":"'[1]Indicator Definitions'!L11","v":"Hospital Episode Statistics (HES), NHS Digital, ONS"},"N"]
[{"$f":"'[1]Indicator Definitions'!A12","v":"S11"},{"$f":"'[1]Indicator Definitions'!B12","v":"Starting Well"},{"$f":"'[1]Indicator Definitions'!C12","v":"Healthcare usage"},{"$f":"'[1]Indicator Definitions'!D12","v":"Elective hospital admissions in children aged 0-4 years"},{"$f":"'[1]Indicator Definitions'!E12","v":"Crude rate per 1,000 children aged 0-4 years"},{"$f":"IF('[1]Indicator Definitions'!F12=0, \"\", '[1]Indicator Definitions'!F12)","v":""},{"$f":"'[1]Indicator Definitions'!G12","v":"Crude rate of elective hospital admissions per 1,000 relevant resident population. Numerator: total number of elective hospital admissions (admission method 1* & FCE sequence 1) using age at activity date for the years used by area of residence. Denominator: mid-year population estimates for the relevant age group and for the years used by area of residence.\n"},{"$f":"IF('[1]Indicator Definitions'!H12=0, \"\", '[1]Indicator Definitions'!H12)","v":"Elective hospital admissions represent an admission planned in advance, unlike an emergency hospital admission. "},{"$f":"IF('[1]Indicator Definitions'!I12=0, \"\", '[1]Indicator Definitions'!I12)","v":"Annual October"},{"$f":"'[1]Indicator Definitions'!L12","v":"Hospital Episode Statistics (HES), NHS Digital, ONS"},"N"]
[{"$f":"'[1]Indicator Definitions'!A13","v":"S12"},{"$f":"'[1]Indicator Definitions'!B13","v":"Starting Well"},{"$f":"'[1]Indicator Definitions'!C13","v":"Healthcare usage"},{"$f":"'[1]Indicator Definitions'!D13","v":"Elective hospital admissions in children and young people aged 0-19 years"},{"$f":"'[1]Indicator Definitions'!E13","v":"Crude rate per 1,000 children and young people aged 0-19 years"},{"$f":"IF('[1]Indicator Definitions'!F13=0, \"\", '[1]Indicator Definitions'!F13)","v":""},{"$f":"'[1]Indicator Definitions'!G13","v":"Crude rate of elective hospital admissions per 1,000 relevant resident population.\nNumerator: total number of elective hospital admissions (admission method 1* & FCE sequence 1) using age at activity date for the years used by area of residence. \nDenominator: mid-year population estimates for the relevant age group and for the years used by area of residence.\n"},{"$f":"IF('[1]Indicator Definitions'!H13=0, \"\", '[1]Indicator Definitions'!H13)","v":"Elective hospital admissions represent an admission planned in advance, unlike an emergency hospital admission. "},{"$f":"IF('[1]Indicator Definitions'!I13=0, \"\", '[1]Indicator Definitions'!I13)","v":"Annual October"},{"$f":"'[1]Indicator Definitions'!L13","v":"Hospital Episode Statistics (HES), NHS Digital, ONS"},"N"]
[{"$f":"'[1]Indicator Definitions'!A14","v":"S16"},{"$f":"'[1]Indicator Definitions'!B14","v":"Starting Well"},{"$f":"'[1]Indicator Definitions'!C14","v":"Healthcare usage"},{"$f":"'[1]Indicator Definitions'!D14","v":"Emergency hospital admissions caused by unintentional and deliberate injuries in children aged 0-14 years"},{"$f":"'[1]Indicator Definitions'!E14","v":"Crude rate per 10,000 children and young people aged 0-14"},{"$f":"IF('[1]Indicator Definitions'!F14=0, \"\", '[1]Indicator Definitions'!F14)","v":"ICD 10: S00-T79, V01-Y36"},{"$f":"'[1]Indicator Definitions'!G14","v":"Crude rate of emergency hospital admissions with diagnostic codes for injury and other adverse events per 10,000 relevant resident population. Numerator: total number of emergency hospital admissions (admission method 2* & FCE sequence 1) with diagnostic codes for injury and other adverse event (ICD 10: S00-T79and/or V01-Y36 in any diagnostic field) using age at activity date for the years used by area of residence. Denominator: mid-year population estimates for the relevant age group and for the years used by area of residence.\n"},{"$f":"IF('[1]Indicator Definitions'!H14=0, \"\", '[1]Indicator Definitions'!H14)","v":"Injuries are a leading cause of premature mortality for children and young people. Use of the external cause codes V01-Y36 would include admissions due to symptoms following an external cause event.  There may be variation in hospital admission clinical coding. This represents Kent residents attending both Kent and non-Kent providers."},{"$f":"IF('[1]Indicator Definitions'!I14=0, \"\", '[1]Indicator Definitions'!I14)","v":"Annual October"},{"$f":"'[1]Indicator Definitions'!L14","v":"Hospital Episode Statistics (HES), NHS Digital, ONS"},"N"]
[{"$f":"'[1]Indicator Definitions'!A15","v":"S15"},{"$f":"'[1]Indicator Definitions'!B15","v":"Starting Well"},{"$f":"'[1]Indicator Definitions'!C15","v":"Healthcare usage"},{"$f":"'[1]Indicator Definitions'!D15","v":"Emergency hospital admissions caused by unintentional and deliberate injuries in children aged 0-4 years"},{"$f":"'[1]Indicator Definitions'!E15","v":"Crude rate per 10,000 children and young people aged 0-4"},{"$f":"IF('[1]Indicator Definitions'!F15=0, \"\", '[1]Indicator Definitions'!F15)","v":"ICD 10: S00-T79, V01-Y36"},{"$f":"'[1]Indicator Definitions'!G15","v":"Crude rate of emergency hospital admissions with diagnostic codes for injury and other adverse events per 10,000 relevant resident population. Numerator: total number of emergency hospital admissions (admission method 2* & FCE sequence 1) with diagnostic codes for injury and other adverse event (ICD 10: S00-T79and/or V01-Y36 in any diagnostic field) using age at activity date for the years used by area of residence. Denominator: mid-year population estimates for the relevant age group and for the years used by area of residence.\n"},{"$f":"IF('[1]Indicator Definitions'!H15=0, \"\", '[1]Indicator Definitions'!H15)","v":"Injuries are a leading cause of premature mortality for children and young people. Use of the external cause codes V01-Y36 would include admissions due to symptoms following an external cause event.  There may be variation in hospital admission clinical coding. This represents Kent residents attending both Kent and non-Kent providers."},{"$f":"IF('[1]Indicator Definitions'!I15=0, \"\", '[1]Indicator Definitions'!I15)","v":"Annual October"},{"$f":"'[1]Indicator Definitions'!L15","v":"Hospital Episode Statistics (HES), NHS Digital, ONS"},"N"]
{"$rows_left_out":94}
{"sheet":"Output","index":2,"n_rows":36,"n_cols":16,"rows_kept":36,"cut":false,"hidden":true,"merged":[[21,1,31,8],[35,1,45,8]]}
[]
[]
[]
[]
[]
[null,"Health & Social Care Maps: Indicator Definitions"]
[null,null,null,null,null,null,null,null,null,null,null,null,null,"Max len","Indicator","Len"]
[null,null,null,null,null,null,null,null,null,null,null,null,"ID",{"$f":"MAX(LEN('Indicator Definitions'!A2:A59))","v":3},"S35",{"$f":"LEN(O8)","v":3}]
[null,null,null,null,null,null,null,null,null,null,null,null,"Doman",{"$f":"MAX(LEN('Indicator Definitions'!D2:D59))","v":63},"Starting Well",{"$f":"LEN(O9)","v":13}]
[null,null,null,null,null,null,null,null,null,null,null,null,"Theme",{"$f":"MAX(LEN('Indicator Definitions'!E2:E59))","v":53},"Healthcare usage",16]
[null,null,null,null,null,null,null,null,null,null,null,null,"Indicator",{"$f":"MAX(LEN('Indicator Definitions'!F2:F59))","v":0},"Hospital admissions for gastroenteritis in infants under 1",58]
[null,null,null,null,null,null,null,null,null,null,null,null,"Subheader",{"$f":"MAX(LEN('Indicator Definitions'!B2:B59))","v":13},"Crude rate per 10,000 resident population",41]
[null,null,null,null,null,null,null,null,null,null,null,null,"Smallprint",{"$f":"MAX(LEN('Indicator Definitions'!C2:C59))","v":16},"ICD 10: A020, A04-5, A072, A080-1, A083-5, A09, K520-2, K528-9 (primary diagnosis)",82]
[null,null,null,null,null,null,null,null,null,null,null,null,"Definition",{"$f":"MAX(LEN('Indicator Definitions'!G2:G59))","v":535},"Crude rate of emergency hospital admissions for gastroenteritis in infants aged under one year per 10,000 relevant resident population. Numerator: total number of emergency hospital admissions (admission method 2* & FCE sequence 1) with a primary diagnosis code for respiratory tract infection (ICD 10: A020, A04-5, A072, A080-1, A083-5, A09, K520-2, K528-9) using age at activity date for the years used by area of residence. Denominator: mid-year population estimates for infants aged under 1 for the years used by area of residence.",535]
[null,null,null,null,null,null,null,null,null,null,null,null,"Notes",{"$f":"MAX(LEN('Indicator Definitions'!H2:H59))","v":336},null,0]
{"$rows_left_out":22}
{"sheet":"Change Log","index":3,"n_rows":2,"n_cols":4,"rows_kept":2,"cut":false,"hidden":true,"merged":[]}
["Date","Version","Comments","Initials"]
["2018-02-23",1,"Public facing version created and linked to master indicator list.","ZC"]

{"sheet":"Sheet1","index":4,"n_rows":3,"n_cols":14,"rows_kept":3,"cut":false,"hidden":true,"merged":[]}
[]
[null,null,null,null,null,null,null,null,null,null,null,null,null,{"$f":"COUNTIF('Indicator Definitions'!J:J, \"Y*\")","v":0}]
[null,null,null,null,null,null,null,null,null,null,null,null,null,{"$f":"(56*N2)","v":0}]